Language,Position,Length_Work,Work_Week,Establish_Size,PSS1,PSS2,PSS3,PSS4,PSS4_R,PSS5,PSS5_R,PSS6,PSS7,PSS7_R,PSS8,PSS8_R,PSS9,PSS10,GAD1,GAD2,PHQ1,PHQ2,PHQ3,PHQ4,PHQ5,PHQ6,PHQ7,PHQ8,PHQ9,EXP1,EXP2,EXP3,EXP4,EXP5,EXP6,EXP7,IES1,IES2,IES3,IES4,IES5,IES6,COF1,COF2,COF3,COF4,COF5,COF6,COF7,SSFA1_R,SSFA2_R,SSFA3_R,SSFA4_R,SSFR1_R,SSFR2_R,SSFR3_R,SSFR4_R,ST1,ST2,ST3,ST4,ST5,ST6,ST7,ST8,ADV1_T,ADV2_T,ADV3_T,ADV4_T,ADV5_T,SSFA1,SSFA2,SSFA3,SSFA4,SSFR1,SSFR2,SSFR3,SSFR4,ETH_AA,ETH_B,ETH_NA,ETH_PI,ETH_L,ETH_W,ETH_O,ETH_O_T,GEN_IDEN_5_TEXT,GEN_IDEN,LGBT,Gen_r,ETH_AA_T,ETH_B_T,ETH_NA_T,ETH_PI_T,ETH_L_T,ETH_W_T,MPSS,MGAD2,MPHQ9,MIES6,MSTHR,MCOF,MTP,MSSFA,MSSFR,Ethnicity,days_year,Age,Rndage,Agegrp,TCOF,TSTHR,TPS,TSSFR_R,TSSFA_R,TPHQ9,TGAD2,TIES6,TCOVEXP
,6.0,5.0,3.0,6.0,0.0,0.0,0.0,0.0,4.0,4.0,0.0,0.0,,,4.0,0.0,0.0,0.0,,,,,,,,,,,,,,,,,,,,,,,,,,,,,,,,,,,,,,,,,,,,,,,,,,,,,,,,,,,,,,,,,,,,,,,,,0.0,0.0,0.0,0.0,0.0,0.0,0.5714285714285714,,,,,,,,,,2020-01-24,,,,,,4.0,,,,,,
EN,3.0,7.0,3.0,6.0,4.0,2.0,4.0,3.0,1.0,3.0,1.0,2.0,2.0,2.0,2.0,2.0,3.0,1.0,,,,,,,,,,,,,,,,,,,,,,,,,,,,,,,,,,,,,,,,,,,,,,,,,,,,,,,,,,,,,,,,,,,,,,,,,0.0,0.0,0.0,0.0,0.0,0.0,2.25,,,,,,,,,,2020-01-24,,,,,,22.0,,,,,,
EN,3.0,6.0,4.0,5.0,2.0,1.0,2.0,2.0,2.0,2.0,2.0,2.0,2.0,2.0,2.0,2.0,2.0,2.0,,,,,,,,,,,,,,,,,,,,,,,,,,,,,,,,,,,,,,,,,,,,,,,,,,,,,,,,,,,,,,,,,,,,,,,,,0.0,0.0,0.0,0.0,0.0,0.0,1.875,,,,,,,,,,2020-01-24,,,,,,19.0,,,,,,
EN,4.0,3.0,,5.0,1.0,1.0,1.0,,,3.0,1.0,1.0,4.0,0.0,3.0,1.0,1.0,1.0,,,,,,,,,,,,,,,,,,,,,,,,,,,,,,,,,,,,,,,,,,,,,,,,,,,,,,,,,,,,,,,,,,,,,,,,,0.0,0.0,0.0,0.0,0.0,0.0,0.8571428571428571,,,,,,,,,,2020-01-24,,,,,,8.0,,,,,,
EN,11.0,6.0,,4.0,2.0,4.0,2.0,4.0,0.0,2.0,2.0,2.0,2.0,2.0,1.0,3.0,2.0,4.0,,,,,,,,,,,,,,,,,,,,,,,,,,,,,,,,,,,,,,,,,,,,,,,,,,,,,,,,,,,,,,,,,,,,,,,,,0.0,0.0,0.0,0.0,0.0,0.0,2.125,,,,,,,,,,2020-01-24,,,,,,23.0,,,,,,
EN,2.0,4.0,4.0,5.0,1.0,2.0,2.0,3.0,1.0,3.0,1.0,1.0,3.0,1.0,3.0,1.0,1.0,1.0,,,,,,,,,,,,,,,,,,,,,,,,,,,,,,,,,,,,,,,,,,,,,,,,,,,,,,,,,,,,,,,,,,,,,,,,,0.0,0.0,0.0,0.0,0.0,0.0,1.25,,,,,,,,,,2020-01-24,,,,,,12.0,,,,,,
EN,3.0,7.0,3.0,5.0,2.0,2.0,2.0,2.0,2.0,2.0,2.0,2.0,2.0,2.0,2.0,2.0,2.0,1.0,,,,,,,,,,,,,,,,,,,,,,,,,,,,,,,,,,,,,,,,,,,,,,,,,,,,,,,,,,,,,,,,,,,,,,,,,0.0,0.0,0.0,0.0,0.0,0.0,2.0,,,,,,,,,,2020-01-24,,,,,,19.0,,,,,,
ES-ES,9.0,7.0,3.0,5.0,2.0,1.0,1.0,4.0,0.0,4.0,0.0,1.0,4.0,0.0,4.0,0.0,2.0,1.0,,,,,,,,,,,,,,,,,,,,,,,,,,,,,,,,,,,,,,,,,,,,,,,,,,,,,,,,,,,,,,,,,,,,,,,,,0.0,0.0,0.0,0.0,0.0,0.0,0.625,,,,,,,,,,2020-01-24,,,,,,8.0,,,,,,
EN,5.0,7.0,4.0,5.0,2.0,2.0,2.0,4.0,0.0,2.0,2.0,0.0,4.0,0.0,4.0,0.0,2.0,0.0,,,,,,,,,,,,,,,,,,,,,,,,,,,,,,,,,,,,,,,,,,,,,,,,,,,,,,,,,,,,,,,,,,,,,,,,,0.0,0.0,0.0,0.0,0.0,0.0,1.0,,,,,,,,,,2020-01-24,,,,,,10.0,,,,,,
EN,3.0,7.0,4.0,6.0,2.0,1.0,2.0,4.0,0.0,3.0,1.0,1.0,3.0,1.0,3.0,1.0,2.0,1.0,,,,,,,,,,,,,,,,,,,,,,,,,,,,,,,,,,,,,,,,,,,,,,,,,,,,,,,,,,,,,,,,,,,,,,,,,0.0,0.0,0.0,0.0,0.0,0.0,1.125,,,,,,,,,,2020-01-24,,,,,,12.0,,,,,,
EN,8.0,4.0,3.0,,0.0,0.0,2.0,2.0,2.0,2.0,2.0,2.0,2.0,2.0,3.0,1.0,2.0,2.0,,,,,,,,,,,,,,,,,,,,,,,,,,,,,,,,,,,,,,,,,,,,,,,,,,,,,,,,,,,,,,,,,,,,,,,,,0.0,0.0,0.0,0.0,0.0,0.0,1.375,,,,,,,,,,2020-01-24,,,,,,15.0,,,,,,
EN,9.0,7.0,3.0,5.0,2.0,2.0,3.0,2.0,2.0,2.0,2.0,2.0,3.0,1.0,3.0,1.0,2.0,3.0,,,,,,,,,,,,,,,,,,,,,,,,,,,,,,,,,,,,,,,,,,,,,,,,,,,,,,,,,,,,,,,,,,,,,,,,,0.0,0.0,0.0,0.0,0.0,0.0,1.875,,,,,,,,,,2020-01-24,,,,,,20.0,,,,,,
EN,4.0,3.0,2.0,5.0,1.0,1.0,3.0,3.0,1.0,3.0,1.0,1.0,3.0,1.0,3.0,1.0,1.0,2.0,,,,,,,,,,,,,,,,,,,,,,,,,,,,,,,,,,,,,,,,,,,,,,,,,,,,,,,,,,,,,,,,,,,,,,,,,0.0,0.0,0.0,0.0,0.0,0.0,1.25,,,,,,,,,,2020-01-24,,,,,,13.0,,,,,,
EN,6.0,7.0,3.0,6.0,1.0,0.0,1.0,4.0,0.0,3.0,1.0,1.0,3.0,1.0,3.0,1.0,1.0,0.0,,,,,,,,,,,,,,,,,,,,,,,,,,,,,,,,,,,,,,,,,,,,,,,,,,,,,,,,,,,,,,,,,,,,,,,,,0.0,0.0,0.0,0.0,0.0,0.0,0.75,,,,,,,,,,2020-01-24,,,,,,7.0,,,,,,
EN,3.0,7.0,3.0,5.0,2.0,0.0,3.0,4.0,0.0,3.0,1.0,1.0,4.0,0.0,3.0,1.0,2.0,1.0,,,,,,,,,,,,,,,,,,,,,,,,,,,,,,,,,,,,,,,,,,,,,,,,,,,,,,,,,,,,,,,,,,,,,,,,,0.0,0.0,0.0,0.0,0.0,0.0,1.0,,,,,,,,,,2020-01-24,,,,,,11.0,,,,,,
EN,1.0,3.0,2.0,5.0,0.0,0.0,4.0,3.0,1.0,2.0,2.0,1.0,3.0,1.0,3.0,1.0,1.0,0.0,,,,,,,,,,,,,,,,,,,,,,,,,,,,,,,,,,,,,,,,,,,,,,,,,,,,,,,,,,,,,,,,,,,,,,,,,0.0,0.0,0.0,0.0,0.0,0.0,1.25,,,,,,,,,,2020-01-24,,,,,,11.0,,,,,,
EN,3.0,3.0,3.0,5.0,1.0,1.0,2.0,3.0,1.0,2.0,2.0,2.0,3.0,1.0,2.0,2.0,1.0,1.0,,,,,,,,,,,,,,,,,,,,,,,,,,,,,,,,,,,,,,,,,,,,,,,,,,,,,,,,,,,,,,,,,,,,,,,,,0.0,0.0,0.0,0.0,0.0,0.0,1.5,,,,,,,,,,2020-01-24,,,,,,14.0,,,,,,
EN,4.0,1.0,3.0,4.0,1.0,1.0,2.0,2.0,2.0,2.0,2.0,1.0,3.0,1.0,2.0,2.0,2.0,1.0,,,,,,,,,,,,,,,,,,,,,,,,,,,,,,,,,,,,,,,,,,,,,,,,,,,,,,,,,,,,,,,,,,,,,,,,,0.0,0.0,0.0,0.0,0.0,0.0,1.5,,,,,,,,,,2020-01-24,,,,,,15.0,,,,,,
EN,11.0,4.0,3.0,5.0,2.0,2.0,2.0,2.0,2.0,2.0,2.0,2.0,2.0,2.0,2.0,2.0,2.0,2.0,,,,,,,,,,,,,,,,,,,,,,,,,,,,,,,,,,,,,,,,,,,,,,,,,,,,,,,,,,,,,,,,,,,,,,,,,0.0,0.0,0.0,0.0,0.0,0.0,2.0,,,,,,,,,,2020-01-24,,,,,,20.0,,,,,,
EN,11.0,7.0,4.0,4.0,1.0,0.0,0.0,4.0,0.0,2.0,2.0,0.0,4.0,0.0,4.0,0.0,1.0,4.0,0.0,0.0,0.0,0.0,0.0,0.0,0.0,0.0,0.0,0.0,0.0,,,,,,,,,,,,,,,,,,,,,,,,,,,,,,,,,,,,,,,,,,,,,,,,,,,,,,,,,,,,,,0.0,0.0,0.0,0.0,0.0,0.0,0.375,0.0,0.0,,,,,,,,2020-01-24,,,,,,8.0,,,0.0,0.0,,
EN,3.0,4.0,3.0,4.0,2.0,1.0,1.0,4.0,0.0,4.0,0.0,3.0,3.0,1.0,2.0,2.0,1.0,1.0,0.0,0.0,1.0,0.0,0.0,1.0,0.0,0.0,1.0,0.0,0.0,,,,,,,,,,,,,,,,,,,,,,,,,,,,,,,,,,,,,,,,,,,,,,,,,,,,,,,,,,,,,,0.0,0.0,0.0,0.0,0.0,0.0,1.25,0.0,0.3333333333333333,,,,,,,,2020-01-24,,,,,,12.0,,,3.0,0.0,,
EN,3.0,7.0,4.0,6.0,,1.0,2.0,3.0,1.0,2.0,2.0,1.0,2.0,2.0,3.0,1.0,2.0,1.0,1.0,1.0,1.0,1.0,3.0,2.0,0.0,0.0,0.0,0.0,0.0,,,,,,,,,,,,,,,,,,,,,,,,,,,,,,,,,,,,,,,,,,,,,,,,,,,,,,,,,,,,,,0.0,0.0,0.0,0.0,0.0,0.0,1.4285714285714286,1.0,0.7777777777777778,,,,,,,,2020-01-24,,,,,,13.0,,,7.0,2.0,,
EN,5.0,7.0,4.0,5.0,1.0,1.0,4.0,3.0,1.0,3.0,1.0,1.0,3.0,1.0,3.0,1.0,1.0,1.0,1.0,1.0,0.0,0.0,0.0,0.0,1.0,0.0,0.0,0.0,0.0,,,,,,,,,,,,,,,,,,,,,,,,,,,,,,,,,,,,,,,,,,,,,,,,,,,,,,,,,,,,,,0.0,0.0,0.0,0.0,0.0,0.0,1.375,1.0,0.1111111111111111,,,,,,,,2020-01-24,,,,,,13.0,,,1.0,2.0,,
EN,11.0,3.0,3.0,2.0,4.0,4.0,4.0,3.0,1.0,2.0,2.0,4.0,2.0,2.0,2.0,2.0,4.0,2.0,1.0,1.0,1.0,1.0,0.0,0.0,0.0,1.0,2.0,1.0,0.0,,,,,,,,,,,,,,,,,,,,,,,,,,,,,,,,,,,,,,,,,,,,,,,,,,,,,,,,,,,,,,0.0,0.0,0.0,0.0,0.0,0.0,2.875,1.0,0.6666666666666666,,,,,,,,2020-01-24,,,,,,29.0,,,6.0,2.0,,
EN,11.0,7.0,3.0,5.0,3.0,1.0,3.0,4.0,0.0,2.0,2.0,1.0,2.0,2.0,2.0,2.0,2.0,0.0,2.0,1.0,,,,,,,,,,,,,,,,,,,,,,,,,,,,,,,,,,,,,,,,,,,,,,,,,,,,,,,,,,,,,,,,,,,,,,,0.0,0.0,0.0,0.0,0.0,0.0,1.75,1.5,,,,,,,,,2020-01-24,,,,,,16.0,,,,3.0,,
EN,6.0,3.0,3.0,5.0,3.0,4.0,4.0,1.0,3.0,1.0,3.0,4.0,1.0,3.0,1.0,3.0,3.0,4.0,3.0,3.0,3.0,2.0,3.0,3.0,1.0,3.0,2.0,1.0,1.0,,,,,,,,,,,,,,,,,,,,,,,,,,,,,,,,,,,,,,,,,,,,,,,,,,,,,,,,,,,,,,0.0,0.0,0.0,0.0,0.0,0.0,3.375,3.0,2.111111111111111,,,,,,,,2020-01-24,,,,,,34.0,,,19.0,6.0,,
EN,2.0,6.0,4.0,6.0,0.0,0.0,1.0,3.0,1.0,3.0,1.0,0.0,4.0,0.0,3.0,1.0,0.0,1.0,0.0,0.0,0.0,0.0,0.0,0.0,0.0,0.0,0.0,0.0,0.0,,,,,,,,,,,,,,,,,,,,,,,,,,,,,,,,,,,,,,,,,,,,,,,,,,,,,,,,,,,,,,0.0,0.0,0.0,0.0,0.0,0.0,0.5,0.0,0.0,,,,,,,,2020-01-24,,,,,,5.0,,,0.0,0.0,,
ES-ES,3.0,3.0,1.0,2.0,2.0,0.0,2.0,4.0,0.0,4.0,0.0,1.0,4.0,0.0,3.0,1.0,4.0,0.0,1.0,0.0,0.0,0.0,1.0,1.0,0.0,0.0,0.0,0.0,0.0,,,,,,,,,,,,,,,,,,,,,,,,,,,,,,,,,,,,,,,,,,,,,,,,,,,,,,,,,,,,,,0.0,0.0,0.0,0.0,0.0,0.0,0.75,0.5,0.2222222222222222,,,,,,,,2020-01-24,,,,,,10.0,,,2.0,1.0,,
EN,9.0,7.0,4.0,6.0,3.0,3.0,3.0,2.0,2.0,2.0,2.0,3.0,3.0,1.0,3.0,1.0,0.0,2.0,2.0,2.0,1.0,1.0,1.0,1.0,0.0,2.0,0.0,0.0,0.0,,,,,,,,,,,,,,,,,,,,,,,,,,,,,,,,,,,,,,,,,,,,,,,,,,,,,,,,,,,,,,0.0,0.0,0.0,0.0,0.0,0.0,2.25,2.0,0.6666666666666666,,,,,,,,2020-01-24,,,,,,20.0,,,6.0,4.0,,
EN,11.0,3.0,3.0,6.0,2.0,0.0,1.0,3.0,1.0,2.0,2.0,1.0,3.0,1.0,1.0,3.0,1.0,0.0,0.0,0.0,3.0,0.0,0.0,1.0,0.0,0.0,1.0,0.0,0.0,,,,,,,,,,,,,,,,,,,,,,,,,,,,,,,,,,,,,,,,,,,,,,,,,,,,,,,,,,,,,,0.0,0.0,0.0,0.0,0.0,0.0,1.375,0.0,0.5555555555555556,,,,,,,,2020-01-24,,,,,,12.0,,,5.0,0.0,,
EN,3.0,3.0,3.0,2.0,3.0,3.0,2.0,3.0,1.0,3.0,1.0,2.0,3.0,1.0,3.0,1.0,2.0,2.0,1.0,1.0,1.0,1.0,1.0,1.0,1.0,1.0,1.0,1.0,0.0,,,,,,,,,,,,,,,,,,,,,,,,,,,,,,,,,,,,,,,,,,,,,,,,,,,,,,,,,,,,,,0.0,0.0,0.0,0.0,0.0,0.0,1.75,1.0,0.8888888888888888,,,,,,,,2020-01-24,,,,,,18.0,,,8.0,2.0,,
EN,11.0,4.0,3.0,,1.0,1.0,1.0,4.0,0.0,4.0,0.0,2.0,,,,,,,0.0,0.0,0.0,0.0,0.0,,,,,,,,,,,,,,,,,,,,,,,,,,,,,,,,,,,,,,,,,,,,,,,,,,,,,,,,,,,,,,,,,,,,0.0,0.0,0.0,0.0,0.0,0.0,0.8333333333333334,0.0,0.0,,,,,,,,2020-01-24,,,,,,5.0,,,0.0,0.0,,
EN,4.0,3.0,3.0,4.0,3.0,3.0,4.0,3.0,1.0,1.0,3.0,2.0,2.0,2.0,2.0,2.0,3.0,3.0,1.0,1.0,1.0,1.0,1.0,1.0,1.0,1.0,1.0,1.0,1.0,,,,,,,,,,,,,,,,,,,,,,,,,,,,,,,,,,,,,,,,,,,,,,,,,,,,,,,,,,,,,,0.0,0.0,0.0,0.0,0.0,0.0,2.5,1.0,1.0,,,,,,,,2020-01-24,,,,,,26.0,,,9.0,2.0,,
EN,8.0,6.0,4.0,5.0,3.0,3.0,4.0,2.0,2.0,2.0,2.0,3.0,3.0,1.0,2.0,2.0,3.0,3.0,2.0,2.0,2.0,1.0,3.0,3.0,3.0,1.0,1.0,1.0,0.0,1.0,0.0,,0.0,,0.0,1.0,,,,,,,,,,,,,,,,,,,,,,,,,,,,,,,,,,,,,,,,,,,,,,,,,,,,,,,0.0,0.0,0.0,0.0,0.0,0.0,2.5,2.0,1.6666666666666667,,,,,,,,2020-01-24,,,,,,26.0,,,15.0,4.0,,2.0
EN,3.0,7.0,3.0,5.0,2.0,2.0,2.0,3.0,1.0,3.0,1.0,1.0,3.0,1.0,2.0,2.0,1.0,2.0,0.0,0.0,1.0,1.0,1.0,1.0,0.0,0.0,0.0,0.0,0.0,1.0,0.0,0.0,0.0,0.0,1.0,,,,,,,,,,,,,,,,,,,,,,,,,,,,,,,,,,,,,,,,,,,,,,,,,,,,,,,,0.0,0.0,0.0,0.0,0.0,0.0,1.5,0.0,0.4444444444444444,,,,,,,,2020-01-24,,,,,,15.0,,,4.0,0.0,,1.0
EN,4.0,4.0,3.0,4.0,4.0,1.0,4.0,4.0,0.0,2.0,2.0,2.0,2.0,2.0,4.0,0.0,0.0,,0.0,0.0,0.0,,0.0,,0.0,0.0,0.0,0.0,0.0,1.0,0.0,0.0,1.0,1.0,1.0,0.0,,,,,,,,,,,,,,,,,,,,,,,,,,,,,,,,,,,,,,,,,,,,,,,,,,,,,,,0.0,0.0,0.0,0.0,0.0,0.0,1.875,0.0,0.0,,,,,,,,2020-01-24,,,,,,15.0,,,0.0,0.0,,1.0
EN,11.0,6.0,2.0,4.0,2.0,2.0,2.0,3.0,1.0,3.0,1.0,1.0,3.0,1.0,3.0,1.0,1.0,1.0,0.0,0.0,1.0,0.0,0.0,1.0,3.0,0.0,1.0,0.0,0.0,1.0,1.0,0.0,1.0,1.0,1.0,,,,,,,,,,,,,,,,,,,,,,,,,,,,,,,,,,,,,,,,,,,,,,,,,,,,,,,,0.0,0.0,0.0,0.0,0.0,0.0,1.375,0.0,0.6666666666666666,,,,,,,,2020-01-24,,,,,,13.0,,,6.0,0.0,,2.0
EN,9.0,4.0,,3.0,0.0,0.0,1.0,4.0,0.0,3.0,1.0,0.0,4.0,0.0,4.0,0.0,0.0,0.0,0.0,,0.0,0.0,0.0,0.0,0.0,0.0,0.0,0.0,0.0,1.0,,1.0,,1.0,1.0,1.0,,,,,,,,,,,,,,,,,,,,,,,,,,,,,,,,,,,,,,,,,,,,,,,,,,,,,,,0.0,0.0,0.0,0.0,0.0,0.0,0.25,0.0,0.0,,,,,,,,2020-01-24,,,,,,2.0,,,0.0,0.0,,3.0
EN,11.0,6.0,3.0,4.0,0.0,0.0,0.0,4.0,0.0,4.0,0.0,0.0,4.0,0.0,4.0,0.0,2.0,0.0,0.0,0.0,0.0,0.0,0.0,0.0,0.0,0.0,0.0,0.0,0.0,1.0,0.0,0.0,1.0,1.0,0.0,1.0,,,,,,,,,,,,,,,,,,,,,,,,,,,,,,,,,,,,,,,,,,,,,,,,,,,,,,,0.0,0.0,0.0,0.0,0.0,0.0,0.0,0.0,0.0,,,,,,,,2020-01-24,,,,,,2.0,,,0.0,0.0,,2.0
EN,11.0,6.0,4.0,6.0,2.0,2.0,3.0,3.0,1.0,3.0,1.0,2.0,3.0,1.0,3.0,1.0,2.0,2.0,1.0,0.0,1.0,1.0,1.0,1.0,0.0,0.0,0.0,0.0,0.0,1.0,0.0,1.0,1.0,0.0,0.0,0.0,,,,,,,,,,,,,,,,,,,,,,,,,,,,,,,,,,,,,,,,,,,,,,,,,,,,,,,0.0,0.0,0.0,0.0,0.0,0.0,1.625,0.5,0.4444444444444444,,,,,,,,2020-01-24,,,,,,17.0,,,4.0,1.0,,2.0
EN,11.0,4.0,3.0,5.0,1.0,0.0,1.0,4.0,0.0,3.0,1.0,0.0,4.0,0.0,4.0,0.0,1.0,0.0,1.0,0.0,0.0,0.0,0.0,0.0,0.0,0.0,0.0,0.0,0.0,,0.0,0.0,1.0,,1.0,,,,,,,,,,,,,,,,,,,,,,,,,,,,,,,,,,,,,,,,,,,,,,,,,,,,,,,,0.0,0.0,0.0,0.0,0.0,0.0,0.375,0.5,0.0,,,,,,,,2020-01-24,,,,,,4.0,,,0.0,1.0,,0.0
EN,11.0,4.0,3.0,4.0,2.0,3.0,2.0,3.0,1.0,2.0,2.0,3.0,2.0,2.0,2.0,2.0,2.0,2.0,1.0,1.0,2.0,1.0,1.0,1.0,0.0,1.0,0.0,1.0,1.0,1.0,1.0,0.0,1.0,0.0,1.0,0.0,,,,,,,,,,,,,,,,,,,,,,,,,,,,,,,,,,,,,,,,,,,,,,,,,,,,,,,0.0,0.0,0.0,0.0,0.0,0.0,2.125,1.0,0.8888888888888888,,,,,,,,2020-01-24,,,,,,21.0,,,8.0,2.0,,2.0
EN,9.0,6.0,4.0,6.0,1.0,1.0,3.0,3.0,1.0,2.0,2.0,1.0,3.0,1.0,2.0,2.0,1.0,1.0,1.0,1.0,1.0,0.0,1.0,1.0,0.0,0.0,0.0,0.0,0.0,1.0,0.0,1.0,0.0,0.0,0.0,0.0,,,,,,,,,,,,,,,,,,,,,,,,,,,,,,,,,,,,,,,,,,,,,,,,,,,,,,,0.0,0.0,0.0,0.0,0.0,0.0,1.5,1.0,0.3333333333333333,,,,,,,,2020-01-24,,,,,,14.0,,,3.0,2.0,,2.0
ES-ES,11.0,4.0,3.0,4.0,1.0,,2.0,2.0,2.0,3.0,1.0,4.0,4.0,0.0,3.0,1.0,3.0,4.0,2.0,0.0,0.0,0.0,0.0,1.0,0.0,0.0,0.0,0.0,0.0,0.0,0.0,0.0,0.0,1.0,0.0,0.0,,,,,,,,,,,,,,,,,,,,,,,,,,,,,,,,,,,,,,,,,,,,,,,,,,,,,,,0.0,0.0,0.0,0.0,0.0,0.0,1.5714285714285714,1.0,0.1111111111111111,,,,,,,,2020-01-24,,,,,,18.0,,,1.0,2.0,,0.0
EN,11.0,4.0,4.0,6.0,2.0,2.0,3.0,4.0,0.0,1.0,3.0,2.0,2.0,2.0,3.0,1.0,3.0,2.0,1.0,1.0,1.0,0.0,3.0,1.0,0.0,0.0,0.0,0.0,0.0,0.0,0.0,1.0,1.0,1.0,0.0,0.0,,,,,,,,,,,,,,,,,,,,,,,,,,,,,,,,,,,,,,,,,,,,,,,,,,,,,,,0.0,0.0,0.0,0.0,0.0,0.0,1.875,1.0,0.5555555555555556,,,,,,,,2020-01-24,,,,,,20.0,,,5.0,2.0,,1.0
EN,8.0,7.0,3.0,7.0,2.0,4.0,3.0,3.0,1.0,2.0,2.0,1.0,3.0,1.0,4.0,0.0,2.0,3.0,1.0,1.0,0.0,1.0,1.0,1.0,0.0,0.0,0.0,0.0,0.0,1.0,1.0,,1.0,1.0,1.0,,,,,,,,,,,,,,,,,,,,,,,,,,,,,,,,,,,,,,,,,,,,,,,,,,,,,,,,0.0,0.0,0.0,0.0,0.0,0.0,1.75,1.0,0.3333333333333333,,,,,,,,2020-01-24,,,,,,19.0,,,3.0,2.0,,2.0
EN,11.0,4.0,,2.0,3.0,1.0,3.0,3.0,1.0,2.0,2.0,2.0,1.0,3.0,1.0,3.0,1.0,1.0,1.0,1.0,0.0,1.0,1.0,1.0,0.0,0.0,2.0,0.0,0.0,0.0,0.0,0.0,1.0,0.0,0.0,0.0,,,,,,,,,,,,,,,,,,,,,,,,,,,,,,,,,,,,,,,,,,,,,,,,,,,,,,,0.0,0.0,0.0,0.0,0.0,0.0,2.25,1.0,0.5555555555555556,,,,,,,,2020-01-24,,,,,,20.0,,,5.0,2.0,,0.0
EN,11.0,5.0,3.0,5.0,3.0,3.0,3.0,2.0,2.0,2.0,2.0,2.0,2.0,2.0,2.0,2.0,3.0,2.0,1.0,1.0,1.0,2.0,2.0,0.0,0.0,0.0,1.0,0.0,1.0,1.0,0.0,0.0,,1.0,1.0,,,,,,,,,,,,,,,,,,,,,,,,,,,,,,,,,,,,,,,,,,,,,,,,,,,,,,,,0.0,0.0,0.0,0.0,0.0,0.0,2.375,1.0,0.7777777777777778,,,,,,,,2020-01-24,,,,,,24.0,,,7.0,2.0,,1.0
EN,3.0,4.0,3.0,5.0,3.0,0.0,4.0,4.0,0.0,2.0,2.0,0.0,4.0,0.0,4.0,0.0,2.0,0.0,3.0,1.0,1.0,1.0,2.0,2.0,3.0,0.0,1.0,0.0,0.0,1.0,,0.0,1.0,1.0,1.0,,,,,,,,,,,,,,,,,,,,,,,,,,,,,,,,,,,,,,,,,,,,,,,,,,,,,,,,0.0,0.0,0.0,0.0,0.0,0.0,1.125,2.0,1.1111111111111112,,,,,,,,2020-01-24,,,,,,11.0,,,10.0,4.0,,1.0
EN,3.0,5.0,3.0,6.0,3.0,4.0,4.0,2.0,2.0,1.0,3.0,2.0,2.0,2.0,2.0,2.0,3.0,2.0,2.0,2.0,2.0,2.0,2.0,3.0,1.0,1.0,2.0,1.0,2.0,,1.0,0.0,1.0,1.0,1.0,0.0,,,,,,,,,,,,,,,,,,,,,,,,,,,,,,,,,,,,,,,,,,,,,,,,,,,,,,,0.0,0.0,0.0,0.0,0.0,0.0,2.75,2.0,1.7777777777777777,,,,,,,,2020-01-24,,,,,,27.0,,,16.0,4.0,,1.0
EN,7.0,3.0,3.0,5.0,2.0,3.0,3.0,2.0,2.0,2.0,2.0,2.0,3.0,1.0,1.0,3.0,2.0,2.0,2.0,2.0,2.0,2.0,0.0,2.0,3.0,0.0,2.0,0.0,0.0,0.0,0.0,0.0,1.0,1.0,1.0,0.0,,,,,,,,,,,,,,,,,,,,,,,,,,,,,,,,,,,,,,,,,,,,,,,,,,,,,,,0.0,0.0,0.0,0.0,0.0,0.0,2.25,2.0,1.2222222222222223,,,,,,,,2020-01-24,,,,,,22.0,,,11.0,4.0,,0.0
EN,11.0,7.0,4.0,3.0,2.0,2.0,3.0,2.0,2.0,4.0,0.0,1.0,2.0,2.0,2.0,2.0,3.0,3.0,2.0,3.0,1.0,1.0,3.0,2.0,1.0,1.0,1.0,0.0,0.0,1.0,0.0,0.0,1.0,1.0,1.0,0.0,,,,,,,,,,,,,,,,,,,,,,,,,,,,,,,,,,,,,,,,,,,,,,,,,,,,,,,0.0,0.0,0.0,0.0,0.0,0.0,1.75,2.5,1.1111111111111112,,,,,,,,2020-01-24,,,,,,20.0,,,10.0,5.0,,1.0
EN,5.0,6.0,4.0,6.0,4.0,3.0,4.0,4.0,0.0,3.0,1.0,0.0,4.0,0.0,3.0,1.0,4.0,2.0,3.0,3.0,2.0,2.0,3.0,1.0,2.0,0.0,1.0,1.0,0.0,0.0,0.0,0.0,1.0,0.0,0.0,0.0,,,,,,,,,,,,,,,,,,,,,,,,,,,,,,,,,,,,,,,,,,,,,,,,,,,,,,,0.0,0.0,0.0,0.0,0.0,0.0,1.625,3.0,1.3333333333333333,,,,,,,,2020-01-24,,,,,,19.0,,,12.0,6.0,,0.0
ES-ES,1.0,3.0,3.0,2.0,2.0,2.0,1.0,4.0,0.0,3.0,1.0,3.0,4.0,0.0,2.0,2.0,2.0,1.0,0.0,0.0,0.0,0.0,0.0,0.0,0.0,0.0,0.0,0.0,0.0,,0.0,0.0,0.0,1.0,0.0,0.0,2.0,3.0,2.0,2.0,2.0,1.0,,,,,,,,,,,,,,,,,,,,,,,,,,,,,,,,,,,,,,,,,,,,,,,,,0.0,0.0,0.0,0.0,0.0,0.0,1.375,0.0,0.0,2.0,,,,,,,2020-01-24,,,,,,14.0,,,0.0,0.0,12.0,0.0
EN,3.0,3.0,3.0,2.0,2.0,1.0,1.0,3.0,1.0,2.0,2.0,2.0,3.0,1.0,4.0,0.0,2.0,0.0,0.0,0.0,1.0,1.0,0.0,1.0,1.0,0.0,0.0,0.0,0.0,0.0,1.0,0.0,0.0,0.0,0.0,0.0,0.0,0.0,0.0,1.0,1.0,0.0,,,,,,,,,,,,,,,,,,,,,,,,,,,,,,,,,,,,,,,,,,,,,,,,,0.0,0.0,0.0,0.0,0.0,0.0,1.25,0.0,0.4444444444444444,0.3333333333333333,,,,,,,2020-01-24,,,,,,12.0,,,4.0,0.0,2.0,1.0
EN,11.0,3.0,3.0,5.0,1.0,1.0,1.0,4.0,0.0,2.0,2.0,0.0,4.0,0.0,3.0,1.0,1.0,1.0,1.0,0.0,0.0,1.0,1.0,1.0,1.0,1.0,0.0,0.0,0.0,,0.0,0.0,1.0,1.0,,1.0,,,,,,,,,,,,,,,,,,,,,,,,,,,,,,,,,,,,,,,,,,,,,,,,,,,,,,,0.0,0.0,0.0,0.0,0.0,0.0,0.75,0.5,0.5555555555555556,,,,,,,,2020-01-24,,,,,,8.0,,,5.0,1.0,,1.0
EN,4.0,5.0,3.0,9.0,3.0,4.0,4.0,4.0,0.0,4.0,0.0,4.0,3.0,1.0,3.0,1.0,4.0,4.0,0.0,1.0,1.0,1.0,0.0,1.0,0.0,1.0,0.0,0.0,0.0,0.0,0.0,0.0,0.0,0.0,0.0,0.0,,,,,,,,,,,,,,,,,,,,,,,,,,,,,,,,,,,,,,,,,,,,,,,,,,,,,,,0.0,0.0,0.0,0.0,0.0,0.0,2.125,0.5,0.4444444444444444,,,,,,,,2020-01-24,,,,,,25.0,,,4.0,1.0,,0.0
EN,3.0,7.0,4.0,9.0,2.0,2.0,2.0,3.0,1.0,3.0,1.0,2.0,3.0,1.0,3.0,1.0,2.0,1.0,1.0,1.0,1.0,0.0,1.0,1.0,0.0,0.0,0.0,0.0,0.0,1.0,1.0,0.0,0.0,1.0,0.0,0.0,3.0,3.0,,,2.0,0.0,,,,,,,,,,,,,,,,,,,,,,,,,,,,,,,,,,,,,,,,,,,,,,,,,0.0,0.0,0.0,0.0,0.0,0.0,1.5,1.0,0.3333333333333333,2.0,,,,,,,2020-01-24,,,,,,15.0,,,3.0,2.0,8.0,2.0
EN,3.0,7.0,3.0,4.0,2.0,0.0,2.0,3.0,1.0,2.0,2.0,0.0,4.0,0.0,4.0,0.0,2.0,0.0,3.0,3.0,1.0,1.0,1.0,1.0,1.0,0.0,0.0,0.0,0.0,1.0,1.0,1.0,1.0,1.0,1.0,,0.0,0.0,0.0,0.0,0.0,0.0,,,,,,,,,,,,,,,,,,,,,,,,,,,,,,,,,,,,,,,,,,,,,,,,,0.0,0.0,0.0,0.0,0.0,0.0,0.875,3.0,0.5555555555555556,0.0,,,,,,,2020-01-24,,,,,,9.0,,,5.0,6.0,0.0,3.0
EN,9.0,2.0,3.0,4.0,1.0,0.0,0.0,3.0,1.0,2.0,2.0,2.0,3.0,1.0,3.0,1.0,2.0,2.0,0.0,0.0,0.0,0.0,1.0,1.0,0.0,0.0,0.0,0.0,0.0,0.0,0.0,0.0,1.0,0.0,0.0,0.0,1.0,2.0,0.0,1.0,3.0,0.0,,,,,,,,,,,,,,,,,,,,,,,,,,,,,,,,,,,,,,,,,,,,,,,,,0.0,0.0,0.0,0.0,0.0,0.0,1.0,0.0,0.2222222222222222,1.1666666666666667,,,,,,,2020-01-24,,,,,,12.0,,,2.0,0.0,7.0,0.0
EN,4.0,4.0,2.0,4.0,0.0,4.0,2.0,0.0,4.0,4.0,0.0,2.0,2.0,2.0,4.0,0.0,2.0,2.0,0.0,0.0,0.0,0.0,0.0,3.0,0.0,0.0,0.0,0.0,0.0,,0.0,0.0,0.0,0.0,0.0,0.0,1.0,0.0,1.0,1.0,1.0,0.0,,,,,,,,,,,,,,,,,,,,,,,,,,,,,,,,,,,,,,,,,,,,,,,,,0.0,0.0,0.0,0.0,0.0,0.0,1.75,0.0,0.3333333333333333,0.6666666666666666,,,,,,,2020-01-24,,,,,,18.0,,,3.0,0.0,4.0,0.0
EN,1.0,4.0,3.0,5.0,2.0,4.0,2.0,2.0,2.0,2.0,2.0,2.0,2.0,2.0,2.0,2.0,2.0,3.0,0.0,0.0,0.0,0.0,0.0,2.0,0.0,1.0,0.0,1.0,0.0,,0.0,0.0,1.0,1.0,0.0,0.0,1.0,3.0,0.0,2.0,1.0,1.0,,,,,,,,,,,,,,,,,,,,,,,,,,,,,,,,,,,,,,,,,,,,,,,,,0.0,0.0,0.0,0.0,0.0,0.0,2.25,0.0,0.4444444444444444,1.3333333333333333,,,,,,,2020-01-24,,,,,,23.0,,,4.0,0.0,8.0,0.0
ES-ES,9.0,3.0,3.0,6.0,0.0,0.0,2.0,4.0,0.0,3.0,1.0,1.0,4.0,0.0,2.0,2.0,1.0,0.0,0.0,0.0,0.0,0.0,3.0,1.0,1.0,0.0,0.0,0.0,0.0,1.0,0.0,0.0,1.0,1.0,1.0,0.0,0.0,1.0,1.0,1.0,3.0,0.0,,,,,,,,,,,,,,,,,,,,,,,,,,,,,,,,,,,,,,,,,,,,,,,,,0.0,0.0,0.0,0.0,0.0,0.0,0.75,0.0,0.5555555555555556,1.0,,,,,,,2020-01-24,,,,,,7.0,,,5.0,0.0,6.0,1.0
EN,8.0,3.0,3.0,,1.0,1.0,1.0,3.0,1.0,3.0,1.0,1.0,3.0,1.0,3.0,1.0,2.0,1.0,0.0,0.0,0.0,0.0,0.0,1.0,0.0,0.0,0.0,0.0,0.0,1.0,0.0,0.0,1.0,1.0,1.0,0.0,0.0,0.0,0.0,0.0,0.0,0.0,,,,,,,,,,,,,,,,,,,,,,,,,,,,,,,,,,,,,,,,,,,,,,,,,0.0,0.0,0.0,0.0,0.0,0.0,1.0,0.0,0.1111111111111111,0.0,,,,,,,2020-01-24,,,,,,11.0,,,1.0,0.0,0.0,1.0
EN,3.0,6.0,3.0,4.0,2.0,0.0,0.0,4.0,0.0,2.0,2.0,2.0,3.0,1.0,2.0,2.0,1.0,1.0,0.0,0.0,0.0,0.0,0.0,0.0,1.0,0.0,0.0,0.0,0.0,1.0,0.0,0.0,1.0,1.0,1.0,1.0,1.0,1.0,1.0,3.0,0.0,0.0,,,,,,,,,,,,,,,,,,,,,,,,,,,,,,,,,,,,,,,,,,,,,,,,,0.0,0.0,0.0,0.0,0.0,0.0,1.125,0.0,0.1111111111111111,1.0,,,,,,,2020-01-24,,,,,,11.0,,,1.0,0.0,6.0,2.0
EN,3.0,6.0,4.0,4.0,2.0,4.0,2.0,4.0,0.0,2.0,2.0,2.0,4.0,0.0,4.0,0.0,1.0,2.0,0.0,0.0,0.0,0.0,0.0,2.0,0.0,0.0,0.0,0.0,0.0,1.0,0.0,0.0,1.0,0.0,1.0,0.0,3.0,0.0,2.0,3.0,3.0,2.0,,,,,,,,,,,,,,,,,,,,,,,,,,,,,,,,,,,,,,,,,,,,,,,,,0.0,0.0,0.0,0.0,0.0,0.0,1.5,0.0,0.2222222222222222,2.1666666666666665,,,,,,,2020-01-24,,,,,,15.0,,,2.0,0.0,13.0,1.0
EN,11.0,4.0,3.0,7.0,2.0,2.0,2.0,4.0,0.0,3.0,1.0,2.0,4.0,0.0,3.0,1.0,3.0,1.0,1.0,0.0,2.0,1.0,2.0,2.0,3.0,0.0,3.0,0.0,,1.0,0.0,0.0,1.0,1.0,1.0,0.0,1.0,1.0,2.0,2.0,3.0,2.0,,,,,,,,,,,,,,,,,,,,,,,,,,,,,,,,,,,,,,,,,,,,,,,,,0.0,0.0,0.0,0.0,0.0,0.0,1.25,0.5,1.625,1.8333333333333333,,,,,,,2020-01-24,,,,,,14.0,,,13.0,1.0,11.0,1.0
EN,11.0,5.0,3.0,5.0,3.0,2.0,3.0,3.0,1.0,3.0,1.0,2.0,3.0,1.0,3.0,1.0,2.0,2.0,1.0,1.0,0.0,0.0,1.0,1.0,0.0,1.0,0.0,0.0,0.0,1.0,0.0,0.0,1.0,1.0,1.0,1.0,0.0,0.0,0.0,0.0,0.0,0.0,,,,,,,,,,,,,,,,,,,,,,,,,,,,,,,,,,,,,,,,,,,,,,,,,0.0,0.0,0.0,0.0,0.0,0.0,1.75,1.0,0.3333333333333333,0.0,,,,,,,2020-01-24,,,,,,18.0,,,3.0,2.0,0.0,2.0
EN,5.0,4.0,4.0,6.0,4.0,0.0,1.0,1.0,3.0,2.0,2.0,3.0,3.0,1.0,2.0,2.0,3.0,3.0,3.0,0.0,1.0,0.0,0.0,0.0,2.0,2.0,2.0,0.0,0.0,0.0,0.0,0.0,0.0,0.0,,0.0,0.0,1.0,1.0,1.0,1.0,1.0,,,,,,,,,,,,,,,,,,,,,,,,,,,,,,,,,,,,,,,,,,,,,,,,,0.0,0.0,0.0,0.0,0.0,0.0,2.0,1.5,0.7777777777777778,0.8333333333333334,,,,,,,2020-01-24,,,,,,22.0,,,7.0,3.0,5.0,0.0
EN,4.0,4.0,3.0,7.0,3.0,4.0,4.0,2.0,2.0,0.0,4.0,3.0,2.0,2.0,0.0,4.0,2.0,2.0,2.0,1.0,1.0,1.0,2.0,1.0,1.0,1.0,1.0,1.0,0.0,0.0,0.0,0.0,1.0,1.0,0.0,0.0,1.0,3.0,1.0,1.0,4.0,1.0,,,,,,,,,,,,,,,,,,,,,,,,,,,,,,,,,,,,,,,,,,,,,,,,,0.0,0.0,0.0,0.0,0.0,0.0,3.25,1.5,1.0,1.8333333333333333,,,,,,,2020-01-24,,,,,,30.0,,,9.0,3.0,11.0,0.0
EN,4.0,6.0,3.0,7.0,3.0,2.0,3.0,2.0,2.0,2.0,2.0,4.0,2.0,2.0,2.0,2.0,4.0,4.0,2.0,2.0,1.0,2.0,3.0,3.0,3.0,2.0,1.0,0.0,2.0,,0.0,0.0,1.0,1.0,1.0,0.0,2.0,2.0,2.0,2.0,2.0,3.0,,,,,,,,,,,,,,,,,,,,,,,,,,,,,,,,,,,,,,,,,,,,,,,,,0.0,0.0,0.0,0.0,0.0,0.0,2.5,2.0,1.8888888888888888,2.1666666666666665,,,,,,,2020-01-24,,,,,,28.0,,,17.0,4.0,13.0,0.0
EN,3.0,4.0,3.0,4.0,4.0,4.0,4.0,4.0,0.0,1.0,3.0,3.0,1.0,3.0,1.0,3.0,4.0,3.0,2.0,2.0,3.0,2.0,2.0,2.0,2.0,2.0,2.0,2.0,2.0,1.0,1.0,0.0,0.0,1.0,1.0,1.0,4.0,4.0,4.0,4.0,4.0,4.0,,,,,,,,,,,,,,,,,,,,,,,,,,,,,,,,,,,,,,,,,,,,,,,,,0.0,0.0,0.0,0.0,0.0,0.0,3.0,2.0,2.111111111111111,4.0,,,,,,,2020-01-24,,,,,,31.0,,,19.0,4.0,24.0,3.0
EN,4.0,4.0,3.0,5.0,4.0,2.0,3.0,3.0,1.0,3.0,1.0,3.0,3.0,1.0,3.0,1.0,2.0,2.0,2.0,3.0,2.0,1.0,3.0,3.0,3.0,1.0,0.0,1.0,1.0,,0.0,0.0,0.0,,,0.0,3.0,2.0,,3.0,3.0,1.0,,,,,,,,,,,,,,,,,,,,,,,,,,,,,,,,,,,,,,,,,,,,,,,,,0.0,0.0,0.0,0.0,0.0,0.0,2.0,2.5,1.6666666666666667,2.4,,,,,,,2020-01-24,,,,,,20.0,,,15.0,5.0,12.0,0.0
EN,11.0,7.0,3.0,1.0,4.0,2.0,4.0,2.0,2.0,1.0,3.0,3.0,2.0,2.0,2.0,2.0,3.0,2.0,3.0,3.0,0.0,3.0,3.0,3.0,1.0,2.0,1.0,2.0,0.0,,,1.0,1.0,0.0,0.0,,4.0,4.0,3.0,4.0,4.0,4.0,,,,,,,,,,,,,,,,,,,,,,,,,,,,,,,,,,,,,,,,,,,,,,,,,0.0,0.0,0.0,0.0,0.0,0.0,2.75,3.0,1.6666666666666667,3.8333333333333335,,,,,,,2020-01-24,,,,,,27.0,,,15.0,6.0,23.0,1.0
EN,8.0,4.0,3.0,5.0,2.0,0.0,0.0,0.0,4.0,3.0,1.0,0.0,4.0,0.0,4.0,0.0,0.0,,0.0,0.0,0.0,0.0,0.0,0.0,0.0,0.0,0.0,0.0,0.0,0.0,0.0,0.0,0.0,0.0,1.0,0.0,0.0,0.0,0.0,0.0,0.0,0.0,,,,,,,,,,,,,,,,,,,,,,,,,,,,,,,,,,,,,,,,,,,,,,,,,0.0,0.0,0.0,0.0,0.0,0.0,0.875,0.0,0.0,0.0,,,,,,,2020-01-24,,,,,,7.0,,,0.0,0.0,0.0,0.0
EN,4.0,3.0,3.0,6.0,0.0,0.0,0.0,4.0,0.0,4.0,0.0,4.0,4.0,0.0,4.0,0.0,4.0,4.0,0.0,0.0,0.0,0.0,0.0,0.0,0.0,0.0,0.0,0.0,0.0,0.0,0.0,,0.0,0.0,0.0,0.0,0.0,0.0,0.0,0.0,0.0,0.0,,,,,,,,,,,,,,,,,,,,,,,,,,,,,,,,,,,,,,,,,,,,,,,,,0.0,0.0,0.0,0.0,0.0,0.0,0.5,0.0,0.0,0.0,,,,,,,2020-01-24,,,,,,12.0,,,0.0,0.0,0.0,0.0
EN,1.0,3.0,3.0,1.0,0.0,2.0,2.0,2.0,2.0,2.0,2.0,2.0,2.0,2.0,3.0,1.0,3.0,3.0,0.0,0.0,1.0,0.0,0.0,0.0,0.0,0.0,0.0,0.0,0.0,0.0,0.0,0.0,0.0,0.0,0.0,0.0,0.0,0.0,0.0,0.0,0.0,0.0,,,,,,,,,,,,,,,,,,,,,,,,,,,,,,,,,,,,,,,,,,,,,,,,,0.0,0.0,0.0,0.0,0.0,0.0,1.625,0.0,0.1111111111111111,0.0,,,,,,,2020-01-24,,,,,,19.0,,,1.0,0.0,0.0,0.0
EN,3.0,6.0,4.0,6.0,2.0,2.0,2.0,4.0,0.0,4.0,0.0,1.0,4.0,0.0,4.0,0.0,1.0,1.0,0.0,0.0,1.0,0.0,0.0,0.0,0.0,0.0,0.0,0.0,0.0,1.0,0.0,0.0,0.0,1.0,0.0,0.0,0.0,0.0,0.0,2.0,1.0,0.0,,,,,,,,,,,,,,,,,,,,,,,,,,,,,,,,,,,,,,,,,,,,,,,,,0.0,0.0,0.0,0.0,0.0,0.0,0.875,0.0,0.1111111111111111,0.5,,,,,,,2020-01-24,,,,,,9.0,,,1.0,0.0,3.0,1.0
EN,4.0,5.0,3.0,4.0,0.0,0.0,1.0,0.0,4.0,1.0,3.0,1.0,1.0,3.0,3.0,1.0,1.0,1.0,0.0,0.0,,0.0,0.0,0.0,0.0,0.0,0.0,0.0,0.0,,0.0,,,,,,0.0,0.0,0.0,0.0,0.0,0.0,,,,,,,,,,,,,,,,,,,,,,,,,,,,,,,,,,,,,,,,,,,,,,,,,0.0,0.0,0.0,0.0,0.0,0.0,1.625,0.0,0.0,0.0,,,,,,,2020-01-24,,,,,,15.0,,,0.0,0.0,0.0,0.0
EN,9.0,4.0,3.0,5.0,2.0,3.0,2.0,4.0,0.0,3.0,1.0,0.0,3.0,1.0,3.0,1.0,1.0,1.0,0.0,1.0,0.0,0.0,0.0,0.0,0.0,0.0,0.0,0.0,0.0,0.0,0.0,0.0,1.0,1.0,1.0,0.0,0.0,0.0,0.0,0.0,0.0,0.0,,,,,,,,,,,,,,,,,,,,,,,,,,,,,,,,,,,,,,,,,,,,,,,,,0.0,0.0,0.0,0.0,0.0,0.0,1.25,0.5,0.0,0.0,,,,,,,2020-01-24,,,,,,12.0,,,0.0,1.0,0.0,0.0
EN,11.0,3.0,2.0,4.0,3.0,2.0,2.0,3.0,1.0,1.0,3.0,2.0,2.0,2.0,2.0,2.0,3.0,2.0,1.0,1.0,1.0,0.0,1.0,3.0,3.0,1.0,0.0,0.0,2.0,0.0,0.0,0.0,1.0,1.0,1.0,0.0,3.0,2.0,2.0,,,,,,,,,,,,,,,,,,,,,,,,,,,,,,,,,,,,,,,,,,,,,,,,,,,,0.0,0.0,0.0,0.0,0.0,0.0,2.125,1.0,1.2222222222222223,2.3333333333333335,,,,,,,2020-01-24,,,,,,22.0,,,11.0,2.0,7.0,0.0
EN,3.0,4.0,3.0,5.0,2.0,1.0,3.0,3.0,1.0,2.0,2.0,1.0,2.0,2.0,3.0,1.0,1.0,2.0,1.0,1.0,2.0,2.0,2.0,2.0,0.0,2.0,0.0,0.0,0.0,1.0,0.0,0.0,,0.0,0.0,0.0,1.0,1.0,1.0,2.0,2.0,1.0,,,,,,,,,,,,,,,,,,,,,,,,,,,,,,,,,,,,,,,,,,,,,,,,,0.0,0.0,0.0,0.0,0.0,0.0,1.625,1.0,1.1111111111111112,1.3333333333333333,,,,,,,2020-01-24,,,,,,16.0,,,10.0,2.0,8.0,1.0
EN,4.0,4.0,3.0,5.0,3.0,3.0,3.0,2.0,2.0,2.0,2.0,3.0,2.0,2.0,2.0,2.0,4.0,2.0,1.0,1.0,1.0,0.0,2.0,2.0,0.0,0.0,0.0,0.0,0.0,1.0,1.0,0.0,0.0,1.0,1.0,,0.0,0.0,1.0,0.0,1.0,0.0,,,,,,,,,,,,,,,,,,,,,,,,,,,,,,,,,,,,,,,,,,,,,,,,,0.0,0.0,0.0,0.0,0.0,0.0,2.5,1.0,0.5555555555555556,0.3333333333333333,,,,,,,2020-01-24,,,,,,26.0,,,5.0,2.0,2.0,2.0